BDBM50307375 CHEMBL589377::N-[(1S,2S,4R)-1-(3,5-difluorophenoxymethyl)-2-hydroxy-4-methoxy-4-phenylcarbamoylbutyl]-5-(methanesulfonyl-methyl-amino)-N'-((R)-1-phenyl-ethyl)-isophthalamide
SMILES CO[C@H](C[C@H](O)[C@H](COc1cc(F)cc(F)c1)NC(=O)c1cc(cc(c1)C(=O)N[C@H](C)c1ccccc1)N(C)CS(C)(=O)=O)C(=O)Nc1ccccc1
InChI Key InChIKey=QPUGHQRBULQGOP-CZCCDBLPSA-N
Data  2 KI
  Tab Delimited (TSV)   2D SDfile   Computed 3D by Vconf -m prep SDfile
Find this compound or compounds like it in BindingDB:
Activity Spreadsheet -- Enzyme Inhibition Constant Data from BindingDB
Found 1 hit for monomerid = 50307375
TargetBeta-secretase 1(Homo sapiens (Human))
Stockholm University
Curated by ChEMBL
LigandPNGBDBM50307375(CHEMBL589377 | N-[(1S,2S,4R)-1-(3,5-difluorophenox...)
Affinity DataKi:  200nM. Assay description: Inhibition of human BACE1 expressed in Escherichia coli cells (BL21(DE3) by TRF assay
In DepthDetails ArticlePubMed